{"text_format":"1","workbook":"xlsx","n_sheets":18,"sheets":["Grunddaten","Bescheid","Online_Gebührenberechnung","September","Oktober","November","Dezember","Januar","Februar","März","April","Mai","Juni","Juli","August","Endabrechung","Hinweise","AG"],"not_rendered":{"charts":0,"images":1,"macros":1,"external_links":0,"defined_names":5,"comments":0,"pivot_tables":0},"unopened":[],"bounds":{"document_bytes":16777216,"sheet_cells":100000,"rows_first":2000,"rows_last":500,"rows_between":2000,"halvings":0,"cell_chars":16384,"cell_head_chars":4096},"cells_cut":0,"cells_raw":0,"read":"whole","date_system":"1900"}

{"sheet":"Grunddaten","index":0,"n_rows":63,"n_cols":7,"rows_kept":63,"cut":false,"hidden":true,"merged":[]}
["Grundbetrag",80]
["Familienermäßigung",0,-0.2,-0.3,-0.4]
[null,"5 Std.","6 Std.","8 Std.","9 Std.","10 Std.","Abendgruppe"]
["Zuschläge",0.2,0.3,0.4,0.55000000000000004,0.7,0.4]
[]
[]
["Betreuung"]
[null,1,2,3,4]
["RG",{"$f":"$B$1*(1+B2)","v":80},{"$f":"$B$1*(1+C2)","v":64},{"$f":"$B$1*(1+D2)","v":56},{"$f":"$B$1*(1+E2)","v":48}]
["HG",{"$f":"B9*$B$26","v":56},{"$f":"C9*$B$26","v":44.8},39.199999999999996,33.599999999999994]
{"$rows_left_out":54}
{"sheet":"Bescheid","index":1,"n_rows":107,"n_cols":5,"rows_kept":107,"cut":false,"hidden":true,"merged":[[101,1,101,4],[19,0,19,4],[42,0,42,4],[91,1,91,2],[94,2,94,4],[100,1,100,4],[75,0,75,4],[76,0,76,4],[86,1,86,3],[88,1,88,4]]}
["Stadt Göppingen"]
["Referat Kinder und Jugend"]
["Pfarrstraße 11"]
["73033 Göppingen"]
[]
[]
["Stadtverwaltung * Postfach 1149 * 73033 Göppingen"]
["Herrn / Frau"]
["Vorname / Name"]
["Straße"]
{"$rows_left_out":98}
{"sheet":"Online_Gebührenberechnung","index":2,"n_rows":42,"n_cols":22,"rows_kept":42,"cut":false,"hidden":true,"merged":[[0,10,0,12]]}
[null,null,null,null,null,null,null,null,null,null,{"$f":"September!B4","v":"2021-09-01"},null,null,null,{"$f":"SUM(O8:O35)","v":0},null,null,null,{"$f":"SUM(S8:S35)","v":0},{"$f":"SUM(T8:T35)","v":0},{"$f":"SUM(U8:U35)","v":0}]
[]
["Gruppe 1"]
[]
[]
[]
["Lfd. Nummer","Neuaufnahme / Abmeldung","Namen","Geburts-datum","Kind / Fam.","Betreuungsform","Differenz Monate","Grundbetrag Monat","VÖ","U3","Nachmittag","Eintritt /Austritt 15.","Basisbetrag","Zusatz-Einzelstd.","Betreuung \ninsgesamt","Bonuskarte (ganzer Monat)","Anzahl Essen pro Woche","Vesper","Verpflegung insgesamt","Monatsgebühr","Erstattung \n1 €-Essen","Anmerkungen"]
[1,null,{"$f":"DATE(YEAR(September!B$4),MONTH(September!B$4),DAY(1))","v":"2021-09-01"},{"$f":"September!B$6","v":"00:00:00"},{"$f":"IF(September!C$31=\"\",\"\",IF(COUNTIF(September!C$9:C$12,\"Ja\")=4,4,COUNTIF(September!C$9:C$12,\"Ja\")+1))","v":""},{"$f":"IF(September!C$31=\"\",\"\",IF(OR(September!C$31=\"VÖ\",September!C$31=\"NM\"),\"RG\",September!C$31))","v":""},{"$f":"DATEDIF(D8,C8,\"m\")","v":1460},{"$f":"IF(E8=\"\",0,INDEX(Grunddaten!$B$9:$E$19,MATCH(F8,Grunddaten!$A$9:$A$19,0),MATCH(E8,Grunddaten!$B$8:$E$8,0)))","v":0},{"$f":"IF(September!C$31=\"VÖ\",\"x\",\"\")","v":""},{"$f":"IF(September!B$7=\"JA\",\"x\",\"\")","v":""},{"$f":"IF(September!C$31=\"NM\",\"x\",\"\")","v":""},null,{"$f":"ROUND(IF(F8=\"SG\",H8*Grunddaten!$B$25,(IF(L8=\"X\",(IF(AND(J8=\"X\",K8=\"X\"),H8*Grunddaten!$B$32,IF(AND(I8=\"X\",J8=\"X\"),H8*Grunddaten!$B$31,IF(I8=\"X\",H8*Grunddaten!$B$28,IF(J8=\"X\",H8*Grunddaten!$B$29,IF(K8=\"X\",H8*Grunddaten!$B$30,H8)))))*Grunddaten!$B$33),IF(AND(J8=\"X\",K8=\"X\"),H8*Grunddaten!$B$32,IF(AND(I8=\"X\",J8=\"X\"),H8*Grunddaten!$B$31,IF(I8=\"X\",H8*Grunddaten!$B$28,IF(J8=\"X\",H8*Grunddaten!$B$29,IF(K8=\"X\",H8*Grunddaten!$B$30,H8)))))))),2)","v":0},null,{"$f":"M8+(N8*Grunddaten!B$35)","v":0},{"$f":"IF(September!B$40=\"\",\"\",September!B$40)","v":""},{"$f":"IF(September!B$37=\"\",\"\",September!B$37)","v":""},{"$f":"IF(September!B$38=\"\",\"\",September!B$38)","v":""},{"$f":"IF(P8=\"\",IF(Q8=5,Grunddaten!$B$38,IF(Q8=4,Grunddaten!$C$38,IF(Q8=3,Grunddaten!$D$38,IF(Q8=2,Grunddaten!$E$38,IF(Q8=1,Grunddaten!$F$38,IF(Q8=\"\",0)))))),(IF(Q8=5,Grunddaten!$B$39,IF(Q8=4,Grunddaten!$C$39,IF(Q8=3,Grunddaten!$D$39,IF(Q8=2,Grunddaten!$E$39,IF(Q8=1,Grunddaten!$F$39,IF(Q8=\"\",0))))))))+IF(R8=\"\",0,Grunddaten!$B$40)","v":0},{"$f":"S8+O8","v":0},{"$f":"IF(P8=\"x\",IF(Q8=5,Grunddaten!$B$38-Grunddaten!$B$39,IF(Q8=4,Grunddaten!$C$38-Grunddaten!$C$39,IF(Q8=3,Grunddaten!$D$38-Grunddaten!$D$39,IF(Q8=2,Grunddaten!$E$38-Grunddaten!$E$39,IF(Q8=1,Grunddaten!$F$38-Grunddaten!$F$39))))),\"\")","v":""}]
[2,null,{"$f":"DATE(YEAR(Oktober!B$4),MONTH(Oktober!B$4),DAY(1))","v":"2021-10-01"},{"$f":"Oktober!B$6","v":"00:00:00"},{"$f":"IF(Oktober!C$31=\"\",\"\",IF(COUNTIF(Oktober!C$9:C$12,\"Ja\")=4,4,COUNTIF(Oktober!C$9:C$12,\"Ja\")+1))","v":""},{"$f":"IF(Oktober!C$31=\"\",\"\",IF(OR(Oktober!C$31=\"VÖ\",Oktober!C$31=\"NM\"),\"RG\",Oktober!C$31))","v":""},{"$f":"DATEDIF(D9,C9,\"m\")","v":1461},{"$f":"IF(E9=\"\",0,INDEX(Grunddaten!$B$9:$E$19,MATCH(F9,Grunddaten!$A$9:$A$19,0),MATCH(E9,Grunddaten!$B$8:$E$8,0)))","v":0},{"$f":"IF(Oktober!C31=\"VÖ\",\"x\",\"\")","v":""},{"$f":"IF(Oktober!B$7=\"JA\",\"x\",\"\")","v":""},{"$f":"IF(Oktober!C$31=\"NM\",\"x\",\"\")","v":""},null,{"$f":"ROUND(IF(F9=\"SG\",H9*Grunddaten!$B$25,(IF(L9=\"X\",(IF(AND(J9=\"X\",K9=\"X\"),H9*Grunddaten!$B$32,IF(AND(I9=\"X\",J9=\"X\"),H9*Grunddaten!$B$31,IF(I9=\"X\",H9*Grunddaten!$B$28,IF(J9=\"X\",H9*Grunddaten!$B$29,IF(K9=\"X\",H9*Grunddaten!$B$30,H9)))))*Grunddaten!$B$33),IF(AND(J9=\"X\",K9=\"X\"),H9*Grunddaten!$B$32,IF(AND(I9=\"X\",J9=\"X\"),H9*Grunddaten!$B$31,IF(I9=\"X\",H9*Grunddaten!$B$28,IF(J9=\"X\",H9*Grunddaten!$B$29,IF(K9=\"X\",H9*Grunddaten!$B$30,H9)))))))),2)","v":0},null,{"$f":"M9+(N9*Grunddaten!B$35)","v":0},{"$f":"IF(Oktober!B$40=\"\",\"\",Oktober!B$40)","v":""},{"$f":"IF(Oktober!B$37=\"\",\"\",Oktober!B$37)","v":0},{"$f":"IF(Oktober!B$38=\"\",\"\",Oktober!B$38)","v":""},{"$f":"IF(P9=\"\",IF(Q9=5,Grunddaten!$B$38,IF(Q9=4,Grunddaten!$C$38,IF(Q9=3,Grunddaten!$D$38,IF(Q9=2,Grunddaten!$E$38,IF(Q9=1,Grunddaten!$F$38,IF(Q9=\"\",0)))))),(IF(Q9=5,Grunddaten!$B$39,IF(Q9=4,Grunddaten!$C$39,IF(Q9=3,Grunddaten!$D$39,IF(Q9=2,Grunddaten!$E$39,IF(Q9=1,Grunddaten!$F$39,IF(Q9=\"\",0))))))))+IF(R9=\"\",0,Grunddaten!$B$40)","v":0},{"$f":"S9+O9","v":0},{"$f":"IF(P9=\"x\",IF(Q9=5,Grunddaten!$B$38-Grunddaten!$B$39,IF(Q9=4,Grunddaten!$C$38-Grunddaten!$C$39,IF(Q9=3,Grunddaten!$D$38-Grunddaten!$D$39,IF(Q9=2,Grunddaten!$E$38-Grunddaten!$E$39,IF(Q9=1,Grunddaten!$F$38-Grunddaten!$F$39))))),\"\")","v":""}]
[3,null,{"$f":"DATE(YEAR(November!B$4),MONTH(November!B$4),DAY(1))","v":"2021-11-01"},{"$f":"November!B$6","v":"00:00:00"},{"$f":"IF(November!C$31=\"\",\"\",IF(COUNTIF(November!C$9:C$12,\"Ja\")=4,4,COUNTIF(November!C$9:C$12,\"Ja\")+1))","v":""},{"$f":"IF(November!C$31=\"\",\"\",IF(OR(November!C$31=\"VÖ\",November!C$31=\"NM\"),\"RG\",November!C$31))","v":""},1462,{"$f":"IF(E10=\"\",0,INDEX(Grunddaten!$B$9:$E$19,MATCH(F10,Grunddaten!$A$9:$A$19,0),MATCH(E10,Grunddaten!$B$8:$E$8,0)))","v":0},{"$f":"IF(November!C31=\"VÖ\",\"x\",\"\")","v":""},{"$f":"IF(November!B$7=\"JA\",\"x\",\"\")","v":""},{"$f":"IF(November!C$31=\"NM\",\"x\",\"\")","v":""},null,{"$f":"ROUND(IF(F10=\"SG\",H10*Grunddaten!$B$25,(IF(L10=\"X\",(IF(AND(J10=\"X\",K10=\"X\"),H10*Grunddaten!$B$32,IF(AND(I10=\"X\",J10=\"X\"),H10*Grunddaten!$B$31,IF(I10=\"X\",H10*Grunddaten!$B$28,IF(J10=\"X\",H10*Grunddaten!$B$29,IF(K10=\"X\",H10*Grunddaten!$B$30,H10)))))*Grunddaten!$B$33),IF(AND(J10=\"X\",K10=\"X\"),H10*Grunddaten!$B$32,IF(AND(I10=\"X\",J10=\"X\"),H10*Grunddaten!$B$31,IF(I10=\"X\",H10*Grunddaten!$B$28,IF(J10=\"X\",H10*Grunddaten!$B$29,IF(K10=\"X\",H10*Grunddaten!$B$30,H10)))))))),2)","v":0},null,{"$f":"M10+(N10*Grunddaten!B$35)","v":0},{"$f":"IF(November!B$40=\"\",\"\",November!B$40)","v":""},{"$f":"IF(November!B$37=\"\",\"\",November!B$37)","v":0},{"$f":"IF(November!B$38=\"\",\"\",November!B$38)","v":""},{"$f":"IF(P10=\"\",IF(Q10=5,Grunddaten!$B$38,IF(Q10=4,Grunddaten!$C$38,IF(Q10=3,Grunddaten!$D$38,IF(Q10=2,Grunddaten!$E$38,IF(Q10=1,Grunddaten!$F$38,IF(Q10=\"\",0)))))),(IF(Q10=5,Grunddaten!$B$39,IF(Q10=4,Grunddaten!$C$39,IF(Q10=3,Grunddaten!$D$39,IF(Q10=2,Grunddaten!$E$39,IF(Q10=1,Grunddaten!$F$39,IF(Q10=\"\",0))))))))+IF(R10=\"\",0,Grunddaten!$B$40)","v":0},0,{"$f":"IF(P10=\"x\",IF(Q10=5,Grunddaten!$B$38-Grunddaten!$B$39,IF(Q10=4,Grunddaten!$C$38-Grunddaten!$C$39,IF(Q10=3,Grunddaten!$D$38-Grunddaten!$D$39,IF(Q10=2,Grunddaten!$E$38-Grunddaten!$E$39,IF(Q10=1,Grunddaten!$F$38-Grunddaten!$F$39))))),\"\")","v":""}]
{"$rows_left_out":33}
{"sheet":"September","index":3,"n_rows":45,"n_cols":3,"rows_kept":45,"cut":false,"hidden":false,"merged":[[23,0,27,0],[20,0,22,0],[0,0,0,2]]}
["Gebührenberechnung \nfür die Kindertagesstätten der Stadt Göppingen"]
[]
[]
["Betreuungsmonat:","2021-09-01"]
[]
["Geburtsdatum des zu betreuenden Kindes"]
["U3-Zuschlag",{"$f":"IF(B4=\"\",\"\",IF(Online_Gebührenberechnung!G8>35,\"\",\"JA\"))","v":""}]
[null,null,"auf Familienrabatt anrechenbar?"]
["Geburtsdatum Geschwisterkinder",null,{"$f":"IF(B9=\"\",\"\",IF(DATEDIF(B9,($B$4-DAY($B$4)+1),\"y\")>=18,\"Nein\",\"Ja\"))","v":""}]
["Geburtsdatum Geschwisterkinder",null,{"$f":"IF(B10=\"\",\"\",IF(DATEDIF(B10,($B$4-DAY($B$4)+1),\"y\")>=18,\"Nein\",\"Ja\"))","v":""}]
{"$rows_left_out":36}
{"sheet":"Oktober","index":4,"n_rows":45,"n_cols":3,"rows_kept":45,"cut":false,"hidden":true,"merged":[[23,0,27,0],[20,0,22,0],[0,0,0,2]]}
["Gebührenberechnung \nfür die Kindertagesstätten der Stadt Göppingen"]
[]
[]
["Betreuungsmonat:",{"$f":"DATE(YEAR(September!B4),MONTH(September!B4)+1,DAY(1))","v":"2021-10-01"}]
[{"$f":"Bescheid!A18","v":"???"}]
["Geburtsdatum des zu betreuenden Kindes",{"$f":"September!B6","v":"00:00:00"}]
["U3-Zuschlag",{"$f":"IF(B4=\"\",\"\",IF(Online_Gebührenberechnung!G9>35,\"\",\"JA\"))","v":""}]
[null,null,"auf Familienrabatt anrechenbar?"]
["Geburtsdatum Geschwisterkinder",{"$f":"IF(September!B9=\"\",\"\",September!B9)","v":""},{"$f":"IF(B9=\"\",\"\",IF(DATEDIF(B9,($B$4-DAY($B$4)+1),\"y\")>=18,\"Nein\",\"Ja\"))","v":""}]
["Geburtsdatum Geschwisterkinder",{"$f":"IF(September!B10=\"\",\"\",September!B10)","v":""},{"$f":"IF(B10=\"\",\"\",IF(DATEDIF(B10,($B$4-DAY($B$4)+1),\"y\")>=18,\"Nein\",\"Ja\"))","v":""}]
{"$rows_left_out":36}
{"sheet":"November","index":5,"n_rows":45,"n_cols":3,"rows_kept":45,"cut":false,"hidden":true,"merged":[[23,0,27,0],[20,0,22,0],[0,0,0,2]]}
["Gebührenberechnung\nfür die Kindertagesstätten der Stadt Göppingen"]
[]
[]
["Betreuungsmonat:",{"$f":"DATE(YEAR(Oktober!B4),MONTH(Oktober!B4)+1,DAY(1))","v":"2021-11-01"}]
[{"$f":"Bescheid!A18","v":"???"}]
["Geburtsdatum des zu betreuenden Kindes",{"$f":"Oktober!B6","v":"00:00:00"}]
["U3-Zuschlag",{"$f":"IF(B4=\"\",\"\",IF(Online_Gebührenberechnung!G10>35,\"\",\"JA\"))","v":""}]
[null,null,"auf Familienrabatt anrechenbar?"]
["Geburtsdatum Geschwisterkinder",{"$f":"IF(Oktober!B9=\"\",\"\",Oktober!B9)","v":""},{"$f":"IF(B9=\"\",\"\",IF(DATEDIF(B9,($B$4-DAY($B$4)+1),\"y\")>=18,\"Nein\",\"Ja\"))","v":""}]
["Geburtsdatum Geschwisterkinder",{"$f":"IF(Oktober!B10=\"\",\"\",Oktober!B10)","v":""},{"$f":"IF(B10=\"\",\"\",IF(DATEDIF(B10,($B$4-DAY($B$4)+1),\"y\")>=18,\"Nein\",\"Ja\"))","v":""}]
{"$rows_left_out":36}
{"sheet":"Dezember","index":6,"n_rows":45,"n_cols":3,"rows_kept":45,"cut":false,"hidden":true,"merged":[[23,0,27,0],[20,0,22,0],[0,0,0,2]]}
["Gebührenberechnung\nfür die Kindertagesstätten der Stadt Göppingen"]
[]
[]
["Betreuungsmonat:",{"$f":"DATE(YEAR(November!B4),MONTH(November!B4)+1,DAY(1))","v":"2021-12-01"}]
[{"$f":"Bescheid!A18","v":"???"}]
["Geburtsdatum des zu betreuenden Kindes",{"$f":"November!B6","v":"00:00:00"}]
["U3-Zuschlag",{"$f":"IF(B4=\"\",\"\",IF(Online_Gebührenberechnung!G11>35,\"\",\"JA\"))","v":""}]
[null,null,"auf Familienrabatt anrechenbar?"]
["Geburtsdatum Geschwisterkinder",{"$f":"IF(November!B9=\"\",\"\",November!B9)","v":""},{"$f":"IF(B9=\"\",\"\",IF(DATEDIF(B9,($B$4-DAY($B$4)+1),\"y\")>=18,\"Nein\",\"Ja\"))","v":""}]
["Geburtsdatum Geschwisterkinder",{"$f":"IF(November!B10=\"\",\"\",November!B10)","v":""},{"$f":"IF(B10=\"\",\"\",IF(DATEDIF(B10,($B$4-DAY($B$4)+1),\"y\")>=18,\"Nein\",\"Ja\"))","v":""}]
{"$rows_left_out":36}
{"sheet":"Januar","index":7,"n_rows":45,"n_cols":3,"rows_kept":45,"cut":false,"hidden":true,"merged":[[23,0,27,0],[20,0,22,0],[0,0,0,2]]}
["Gebührenberechnung\nfür die Kindertagesstätten der Stadt Göppingen"]
[]
[]
["Betreuungsmonat:",{"$f":"DATE(YEAR(Dezember!B4),MONTH(Dezember!B4)+1,DAY(1))","v":"2022-01-01"}]
[{"$f":"Bescheid!A18","v":"???"}]
["Geburtsdatum des zu betreuenden Kindes",{"$f":"Dezember!B6","v":"00:00:00"}]
["U3-Zuschlag",{"$f":"IF(B4=\"\",\"\",IF(Online_Gebührenberechnung!G12>35,\"\",\"JA\"))","v":""}]
[null,null,"auf Familienrabatt anrechenbar?"]
["Geburtsdatum Geschwisterkinder",{"$f":"IF(Dezember!B9=\"\",\"\",Dezember!B9)","v":""},{"$f":"IF(B9=\"\",\"\",IF(DATEDIF(B9,($B$4-DAY($B$4)+1),\"y\")>=18,\"Nein\",\"Ja\"))","v":""}]
["Geburtsdatum Geschwisterkinder",{"$f":"IF(Dezember!B10=\"\",\"\",Dezember!B10)","v":""},{"$f":"IF(B10=\"\",\"\",IF(DATEDIF(B10,($B$4-DAY($B$4)+1),\"y\")>=18,\"Nein\",\"Ja\"))","v":""}]
{"$rows_left_out":36}
{"sheet":"Februar","index":8,"n_rows":45,"n_cols":3,"rows_kept":45,"cut":false,"hidden":true,"merged":[[23,0,27,0],[20,0,22,0],[0,0,0,2]]}
["Gebührenberechnung\nfür die Kindertagesstätten der Stadt Göppingen"]
[]
[]
["Betreuungsmonat:",{"$f":"DATE(YEAR(Januar!B4),MONTH(Januar!B4)+1,DAY(1))","v":"2022-02-01"}]
[{"$f":"Bescheid!A18","v":"???"}]
["Geburtsdatum des zu betreuenden Kindes",{"$f":"Januar!B6","v":"00:00:00"}]
["U3-Zuschlag",{"$f":"IF(B4=\"\",\"\",IF(Online_Gebührenberechnung!G13>35,\"\",\"JA\"))","v":""}]
[null,null,"auf Familienrabatt anrechenbar?"]
["Geburtsdatum Geschwisterkinder",{"$f":"IF(Januar!B9=\"\",\"\",Januar!B9)","v":""},{"$f":"IF(B9=\"\",\"\",IF(DATEDIF(B9,($B$4-DAY($B$4)+1),\"y\")>=18,\"Nein\",\"Ja\"))","v":""}]
["Geburtsdatum Geschwisterkinder",{"$f":"IF(Januar!B10=\"\",\"\",Januar!B10)","v":""},{"$f":"IF(B10=\"\",\"\",IF(DATEDIF(B10,($B$4-DAY($B$4)+1),\"y\")>=18,\"Nein\",\"Ja\"))","v":""}]
{"$rows_left_out":36}
{"sheet":"März","index":9,"n_rows":45,"n_cols":3,"rows_kept":45,"cut":false,"hidden":true,"merged":[[23,0,27,0],[20,0,22,0],[0,0,0,2]]}
["Gebührenberechnung\nfür die Kindertagesstätten der Stadt Göppingen"]
[]
[]
["Betreuungsmonat:",{"$f":"DATE(YEAR(Februar!B4),MONTH(Februar!B4)+1,DAY(1))","v":"2022-03-01"}]
[{"$f":"Bescheid!A18","v":"???"}]
["Geburtsdatum des zu betreuenden Kindes",{"$f":"Februar!B6","v":"00:00:00"}]
["U3-Zuschlag",{"$f":"IF(B4=\"\",\"\",IF(Online_Gebührenberechnung!G14>35,\"\",\"JA\"))","v":""}]
[null,null,"auf Familienrabatt anrechenbar?"]
["Geburtsdatum Geschwisterkinder",{"$f":"IF(Februar!B9=\"\",\"\",Februar!B9)","v":""},{"$f":"IF(B9=\"\",\"\",IF(DATEDIF(B9,($B$4-DAY($B$4)+1),\"y\")>=18,\"Nein\",\"Ja\"))","v":""}]
["Geburtsdatum Geschwisterkinder",{"$f":"IF(Februar!B10=\"\",\"\",Februar!B10)","v":""},{"$f":"IF(B10=\"\",\"\",IF(DATEDIF(B10,($B$4-DAY($B$4)+1),\"y\")>=18,\"Nein\",\"Ja\"))","v":""}]
{"$rows_left_out":36}
{"sheet":"April","index":10,"n_rows":45,"n_cols":3,"rows_kept":45,"cut":false,"hidden":true,"merged":[[23,0,27,0],[20,0,22,0],[0,0,0,2]]}
["Gebührenberechnung\nfür die Kindertagesstätten der Stadt Göppingen"]
[]
[]
["Betreuungsmonat:",{"$f":"DATE(YEAR(März!B4),MONTH(März!B4)+1,DAY(1))","v":"2022-04-01"}]
[{"$f":"Bescheid!A18","v":"???"}]
["Geburtsdatum des zu betreuenden Kindes",{"$f":"März!B6","v":"00:00:00"}]
["U3-Zuschlag",{"$f":"IF(B4=\"\",\"\",IF(Online_Gebührenberechnung!G15>35,\"\",\"JA\"))","v":""}]
[null,null,"auf Familienrabatt anrechenbar?"]
["Geburtsdatum Geschwisterkinder",{"$f":"IF(März!B9=\"\",\"\",März!B9)","v":""},{"$f":"IF(B9=\"\",\"\",IF(DATEDIF(B9,($B$4-DAY($B$4)+1),\"y\")>=18,\"Nein\",\"Ja\"))","v":""}]
["Geburtsdatum Geschwisterkinder",{"$f":"IF(März!B10=\"\",\"\",März!B10)","v":""},{"$f":"IF(B10=\"\",\"\",IF(DATEDIF(B10,($B$4-DAY($B$4)+1),\"y\")>=18,\"Nein\",\"Ja\"))","v":""}]
{"$rows_left_out":36}
{"sheet":"Mai","index":11,"n_rows":45,"n_cols":3,"rows_kept":45,"cut":false,"hidden":true,"merged":[[23,0,27,0],[20,0,22,0],[0,0,0,2]]}
["Gebührenberechnung\nfür die Kindertagesstätten der Stadt Göppingen"]
[]
[]
["Betreuungsmonat:",{"$f":"DATE(YEAR(April!B4),MONTH(April!B4)+1,DAY(1))","v":"2022-05-01"}]
[{"$f":"Bescheid!A18","v":"???"}]
["Geburtsdatum des zu betreuenden Kindes",{"$f":"April!B6","v":"00:00:00"}]
["U3-Zuschlag",{"$f":"IF(B4=\"\",\"\",IF(Online_Gebührenberechnung!G16>35,\"\",\"JA\"))","v":""}]
[null,null,"auf Familienrabatt anrechenbar?"]
["Geburtsdatum Geschwisterkinder",{"$f":"IF(April!B9=\"\",\"\",April!B9)","v":""},{"$f":"IF(B9=\"\",\"\",IF(DATEDIF(B9,($B$4-DAY($B$4)+1),\"y\")>=18,\"Nein\",\"Ja\"))","v":""}]
["Geburtsdatum Geschwisterkinder",{"$f":"IF(April!B10=\"\",\"\",April!B10)","v":""},{"$f":"IF(B10=\"\",\"\",IF(DATEDIF(B10,($B$4-DAY($B$4)+1),\"y\")>=18,\"Nein\",\"Ja\"))","v":""}]
{"$rows_left_out":36}
{"sheet":"Juni","index":12,"n_rows":45,"n_cols":3,"rows_kept":45,"cut":false,"hidden":true,"merged":[[23,0,27,0],[20,0,22,0],[0,0,0,2]]}
["Gebührenberechnung\nfür die Kindertagesstätten der Stadt Göppingen"]
[]
[]
["Betreuungsmonat:",{"$f":"DATE(YEAR(Mai!B4),MONTH(Mai!B4)+1,DAY(1))","v":"2022-06-01"}]
[{"$f":"Bescheid!A18","v":"???"}]
["Geburtsdatum des zu betreuenden Kindes",{"$f":"Mai!B6","v":"00:00:00"}]
["U3-Zuschlag",{"$f":"IF(B4=\"\",\"\",IF(Online_Gebührenberechnung!G17>35,\"\",\"JA\"))","v":""}]
[null,null,"auf Familienrabatt anrechenbar?"]
["Geburtsdatum Geschwisterkinder",{"$f":"IF(Mai!B9=\"\",\"\",Mai!B9)","v":""},{"$f":"IF(B9=\"\",\"\",IF(DATEDIF(B9,($B$4-DAY($B$4)+1),\"y\")>=18,\"Nein\",\"Ja\"))","v":""}]
["Geburtsdatum Geschwisterkinder",{"$f":"IF(Mai!B10=\"\",\"\",Mai!B10)","v":""},{"$f":"IF(B10=\"\",\"\",IF(DATEDIF(B10,($B$4-DAY($B$4)+1),\"y\")>=18,\"Nein\",\"Ja\"))","v":""}]
{"$rows_left_out":36}
{"sheet":"Juli","index":13,"n_rows":45,"n_cols":3,"rows_kept":45,"cut":false,"hidden":true,"merged":[[23,0,27,0],[20,0,22,0],[0,0,0,2]]}
["Gebührenberechnung\nfür die Kindertagesstätten der Stadt Göppingen"]
[]
[]
["Betreuungsmonat:",{"$f":"DATE(YEAR(Juni!B4),MONTH(Juni!B4)+1,DAY(1))","v":"2022-07-01"}]
[{"$f":"Bescheid!A18","v":"???"}]
["Geburtsdatum des zu betreuenden Kindes",{"$f":"Juni!B6","v":"00:00:00"}]
["U3-Zuschlag",{"$f":"IF(B4=\"\",\"\",IF(Online_Gebührenberechnung!G18>35,\"\",\"JA\"))","v":""}]
[null,null,"auf Familienrabatt anrechenbar?"]
["Geburtsdatum Geschwisterkinder",{"$f":"IF(Juni!B9=\"\",\"\",Juni!B9)","v":""},{"$f":"IF(B9=\"\",\"\",IF(DATEDIF(B9,($B$4-DAY($B$4)+1),\"y\")>=18,\"Nein\",\"Ja\"))","v":""}]
["Geburtsdatum Geschwisterkinder",{"$f":"IF(Juni!B10=\"\",\"\",Juni!B10)","v":""},{"$f":"IF(B10=\"\",\"\",IF(DATEDIF(B10,($B$4-DAY($B$4)+1),\"y\")>=18,\"Nein\",\"Ja\"))","v":""}]
{"$rows_left_out":36}
{"sheet":"August","index":14,"n_rows":45,"n_cols":3,"rows_kept":45,"cut":false,"hidden":true,"merged":[[23,0,27,0],[20,0,22,0],[0,0,0,2]]}
["Gebührenberechnung\nfür die Kindertagesstätten der Stadt Göppingen"]
[]
[]
["Betreuungsmonat:",{"$f":"DATE(YEAR(Juli!B4),MONTH(Juli!B4)+1,DAY(1))","v":"2022-08-01"}]
[{"$f":"Bescheid!A18","v":"???"}]
["Geburtsdatum des zu betreuenden Kindes",{"$f":"Juli!B6","v":"00:00:00"}]
["U3-Zuschlag",{"$f":"IF(B4=\"\",\"\",IF(Online_Gebührenberechnung!G19>35,\"\",\"JA\"))","v":""}]
[null,null,"auf Familienrabatt anrechenbar?"]
["Geburtsdatum Geschwisterkinder",{"$f":"IF(Juli!B9=\"\",\"\",Juli!B9)","v":""},{"$f":"IF(B9=\"\",\"\",IF(DATEDIF(B9,($B$4-DAY($B$4)+1),\"y\")>=18,\"Nein\",\"Ja\"))","v":""}]
["Geburtsdatum Geschwisterkinder",{"$f":"IF(Juli!B10=\"\",\"\",Juli!B10)","v":""},{"$f":"IF(B10=\"\",\"\",IF(DATEDIF(B10,($B$4-DAY($B$4)+1),\"y\")>=18,\"Nein\",\"Ja\"))","v":""}]
{"$rows_left_out":36}
{"sheet":"Endabrechung","index":15,"n_rows":52,"n_cols":8,"rows_kept":52,"cut":false,"hidden":true,"merged":[[42,0,42,7],[19,0,19,7]]}
["Stadt Göppingen"]
["Referat Kinder und Jugend"]
["Pfarrstraße 11"]
["73033 Göppingen"]
[]
[]
[]
[{"$f":"Bescheid!A8","v":"Herrn / Frau"}]
[{"$f":"Bescheid!A9","v":"Vorname / Name"}]
[{"$f":"Bescheid!A10","v":"Straße"}]
{"$rows_left_out":43}
{"sheet":"Hinweise","index":16,"n_rows":61,"n_cols":1,"rows_kept":61,"cut":false,"hidden":false,"merged":[]}
["Verfahrenshinweise:"]
[]
["Tabellenblatt Bescheid:"]
["auszufüllen sind:"]
["Adressfeld der Zahlungspflichtigen (Felder A8 bis A 11)"]
["Vorname des Kindes (Feld A18)"]
["Name der Kita (Feld C19)"]
["PK-Nummer (Feld C38)"]
[]
["Tabellenblatt September:"]
{"$rows_left_out":52}
{"sheet":"AG","index":17,"n_rows":42,"n_cols":15,"rows_kept":42,"cut":false,"hidden":true,"merged":[[5,7,5,8],[5,9,5,10]]}
[null,null,null,null,null,null,null,null,null,null,null,{"$f":"SUM(L8:L35)","v":0},null,{"$f":"SUM(N8:N35)","v":0}]
[]
["Abendgruppe"]
[]
[]
[]
["Lfd. Nummer","Neuaufnahme / Abmeldung","Namen","Kind / Fam.","Betreuungsform","U3","Grundbetrag Stunde","Stunden Woche 1","Stunden Woche 2","Stunden Woche 3","Stunden Woche 4","Abendbetreuung ","Vesper","Abendbetreuung insgesamt","Anmerkungen"]
[1,null,null,{"$f":"(COUNTIF(September!C$9:C$12,\"Ja\"))+1","v":1},"ag",{"$f":"IF(September!B$7=\"JA\",\"x\",\"\")","v":""},{"$f":"IF(D8=\"\",0,IF(F8=\"x\",(INDEX(Grunddaten!$B$9:$E$21,MATCH(E8,Grunddaten!$A$9:$A$21,0),MATCH(D8,Grunddaten!$B$8:$E$8,0))*Grunddaten!$B$29),INDEX(Grunddaten!$B$9:$E$21,MATCH(E8,Grunddaten!$A$9:$A$21,0),MATCH(D8,Grunddaten!$B$8:$E$8,0))))","v":32},null,null,null,null,{"$f":"G8*SUM(H8:K8)","v":0},null,{"$f":"IF(M8=\"x\",G8*SUM(H8:K8)+Grunddaten!$B$40,G8*SUM(H8:K8))","v":0}]
[2,null,null,{"$f":"(COUNTIF(Oktober!C$9:C$12,\"Ja\"))+1","v":1},"ag",{"$f":"IF(Oktober!B$7=\"JA\",\"x\",\"\")","v":""},{"$f":"IF(D9=\"\",0,IF(F9=\"x\",(INDEX(Grunddaten!$B$9:$E$21,MATCH(E9,Grunddaten!$A$9:$A$21,0),MATCH(D9,Grunddaten!$B$8:$E$8,0))*Grunddaten!$B$29),INDEX(Grunddaten!$B$9:$E$21,MATCH(E9,Grunddaten!$A$9:$A$21,0),MATCH(D9,Grunddaten!$B$8:$E$8,0))))","v":32},null,null,null,null,{"$f":"G9*SUM(H9:K9)","v":0},null,{"$f":"IF(M9=\"x\",G9*SUM(H9:K9)+Grunddaten!$B$40,G9*SUM(H9:K9))","v":0}]
[3,null,null,{"$f":"(COUNTIF(November!C$9:C$12,\"Ja\"))+1","v":1},"ag",{"$f":"IF(November!B$7=\"JA\",\"x\",\"\")","v":""},{"$f":"IF(D10=\"\",0,IF(F10=\"x\",(INDEX(Grunddaten!$B$9:$E$21,MATCH(E10,Grunddaten!$A$9:$A$21,0),MATCH(D10,Grunddaten!$B$8:$E$8,0))*Grunddaten!$B$29),INDEX(Grunddaten!$B$9:$E$21,MATCH(E10,Grunddaten!$A$9:$A$21,0),MATCH(D10,Grunddaten!$B$8:$E$8,0))))","v":32},null,null,null,null,0,null,{"$f":"IF(M10=\"x\",G10*SUM(H10:K10)+Grunddaten!$B$40,G10*SUM(H10:K10))","v":0}]
{"$rows_left_out":32}